NerdKits - electronics education for a digital generation

You are not logged in. [log in]

NEW: Learning electronics? Ask your questions on the new Electronics Questions & Answers site hosted by CircuitLab.

Support Forum » Won't Compile initialload

June 01, 2012
by cacope
cacope's Avatar

I have followed the instructions in Step 10c and when i execute the make file i get the following :

make -C ../libnerdkits
make[1]: Entering directory `D:/Nerd Kits Info/Nerd Kit Data/Code/libnerdkits'
avr-gcc -g -Os -Wall -mmcu=atmega168  -o lcd.o -c lcd.c
In file included from c:/winavr-20090313/lib/gcc/../../avr/include/avr/io.h:236,
                 from lcd.c:12:
c:/winavr-20090313/lib/gcc/../../avr/include/avr/iom168.h:1: error: stray '\4' in program
c:/winavr-20090313/lib/gcc/../../avr/include/avr/iom168.h:1: error: stray '\301' in program
c:/winavr-20090313/lib/gcc/../../avr/include/avr/iom168.h:1: error: expected identifier or '(' before '/' token
c:/winavr-20090313/lib/gcc/../../avr/include/avr/iom168.h:1: error: stray '\337' in program
c:/winavr-20090313/lib/gcc/../../avr/include/avr/iom168.h:1: error: stray '\346' in program
c:/winavr-20090313/lib/gcc/../../avr/include/avr/iom168.h:1: error: stray '\4' in program
c:/winavr-20090313/lib/gcc/../../avr/include/avr/iom168.h:1: error: stray '\301' in program
c:/winavr-20090313/lib/gcc/../../avr/include/avr/iom168.h:1: error: stray '\337' in program
c:/winavr-20090313/lib/gcc/../../avr/include/avr/iom168.h:1: error: stray '\346' in program
c:/winavr-20090313/lib/gcc/../../avr/include/avr/iom168.h:1: error: stray '\202' in program
c:/winavr-20090313/lib/gcc/../../avr/include/avr/iom168.h:1: error: stray '\250' in program
c:/winavr-20090313/lib/gcc/../../avr/include/avr/iom168.h:1: error: stray '\257' in program
c:/winavr-20090313/lib/gcc/../../avr/include/avr/iom168.h:1: error: stray '\235' in program
c:/winavr-20090313/lib/gcc/../../avr/include/avr/iom168.h:1: error: stray '\307' in program
c:/winavr-20090313/lib/gcc/../../avr/include/avr/iom168.h:1: error: stray '\275' in program
c:/winavr-20090313/lib/gcc/../../avr/include/avr/iom168.h:1: error: stray '\227' in program
c:/winavr-20090313/lib/gcc/../../avr/include/avr/iom168.h:1: error: stray '\31' in program
c:/winavr-20090313/lib/gcc/../../avr/include/avr/iom168.h:1: error: stray '\17' in program
c:/winavr-20090313/lib/gcc/../../avr/include/avr/iom168.h:1: error: stray '\4' in program
c:/winavr-20090313/lib/gcc/../../avr/include/avr/iom168.h:1: error: stray '\6' in program
c:/winavr-20090313/lib/gcc/../../avr/include/avr/iom168.h:1: error: stray '\1' in program
c:/winavr-20090313/lib/gcc/../../avr/include/avr/iom168.h:1: error: stray '\1' in program
c:/winavr-20090313/lib/gcc/../../avr/include/avr/iom168.h:1: error: stray '#' in program
c:/winavr-20090313/lib/gcc/../../avr/include/avr/iom168.h:1: error: stray '\6' in program
In file included from c:/winavr-20090313/lib/gcc/../../avr/include/avr/io.h:236,
                 from lcd.c:12:
c:/winavr-20090313/lib/gcc/../../avr/include/avr/iom168.h:1:66: error: invalid suffix "y.cdn.adblade.com" on floating constant
c:/winavr-20090313/lib/gcc/../../avr/include/avr/iom168.h:1: error: stray '\306' in program
c:/winavr-20090313/lib/gcc/../../avr/include/avr/iom168.h:1: error: stray '\213' in program
c:/winavr-20090313/lib/gcc/../../avr/include/avr/iom168.h:1: error: stray '\4' in program
c:/winavr-20090313/lib/gcc/../../avr/include/avr/iom168.h:1: error: stray '\301' in program
c:/winavr-20090313/lib/gcc/../../avr/include/avr/iom168.h:1: error: stray '\337' in program
c:/winavr-20090313/lib/gcc/../../avr/include/avr/iom168.h:1: error: stray '\346' in program
c:/winavr-20090313/lib/gcc/../../avr/include/avr/iom168.h:1: error: stray '\4' in program
c:/winavr-20090313/lib/gcc/../../avr/include/avr/iom168.h:1: error: stray '\301' in program
c:/winavr-20090313/lib/gcc/../../avr/include/avr/iom168.h:1: error: missing terminating " character
c:/winavr-20090313/lib/gcc/../../avr/include/avr/iom168.h:2: error: stray '\5' in program
c:/winavr-20090313/lib/gcc/../../avr/include/avr/iom168.h:2: error: stray '\1' in program
c:/winavr-20090313/lib/gcc/../../avr/include/avr/iom168.h:2: error: stray '\310' in program
c:/winavr-20090313/lib/gcc/../../avr/include/avr/iom168.h:2: error: stray '\2' in program
c:/winavr-20090313/lib/gcc/../../avr/include/avr/iom168.h:2: error: stray '\2' in program
c:/winavr-20090313/lib/gcc/../../avr/include/avr/iom168.h:2: error: stray '\244' in program
c:/winavr-20090313/lib/gcc/../../avr/include/avr/iom168.h:2: error: stray '\3' in program
c:/winavr-20090313/lib/gcc/../../avr/include/avr/iom168.h:2: error: stray '\24' in program
c:/winavr-20090313/lib/gcc/../../avr/include/avr/iom168.h:2: error: stray '\1' in program
c:/winavr-20090313/lib/gcc/../../avr/include/avr/iom168.h:2: error: stray '\310' in program
c:/winavr-20090313/lib/gcc/../../avr/include/avr/iom168.h:2: error: stray '\3' in program
c:/winavr-20090313/lib/gcc/../../avr/include/avr/iom168.h:2: error: stray '\3' in program
c:/winavr-20090313/lib/gcc/../../avr/include/avr/iom168.h:2: error: expected identifier or '(' before '}' token
c:/winavr-20090313/lib/gcc/../../avr/include/avr/iom168.h:2: error: stray '\3' in program
c:/winavr-20090313/lib/gcc/../../avr/include/avr/iom168.h:2: error: expected identifier or '(' before '}' token
c:/winavr-20090313/lib/gcc/../../avr/include/avr/iom168.h:2: error: stray '\3' in program
c:/winavr-20090313/lib/gcc/../../avr/include/avr/iom168.h:2: error: expected identifier or '(' before '}' token
c:/winavr-20090313/lib/gcc/../../avr/include/avr/iom168.h:2: error: stray '\1' in program
c:/winavr-20090313/lib/gcc/../../avr/include/avr/iom168.h:2: error: stray '\257' in program
c:/winavr-20090313/lib/gcc/../../avr/include/avr/iom168.h:2: error: stray '\266' in program
c:/winavr-20090313/lib/gcc/../../avr/include/avr/iom168.h:2: error: stray '\240' in program
c:/winavr-20090313/lib/gcc/../../avr/include/avr/iom168.h:2: error: expected '=', ',', ';', 'asm' or '__attribute__' before ']' token
c:/winavr-20090313/lib/gcc/../../avr/include/avr/iom168.h:2: error: stray '\202' in program
c:/winavr-20090313/lib/gcc/../../avr/include/avr/iom168.h:2: error: stray '\243' in program
c:/winavr-20090313/lib/gcc/../../avr/include/avr/iom168.h:2: error: stray '\265' in program
c:/winavr-20090313/lib/gcc/../../avr/include/avr/iom168.h:2: error: stray '\267' in program
c:/winavr-20090313/lib/gcc/../../avr/include/avr/iom168.h:2: error: stray '\216' in program
c:/winavr-20090313/lib/gcc/../../avr/include/avr/iom168.h:2: error: stray '\212' in program
c:/winavr-20090313/lib/gcc/../../avr/include/avr/iom168.h:2: error: stray '\376' in program
c:/winavr-20090313/lib/gcc/../../avr/include/avr/iom168.h:2: error: stray '\25' in program
c:/winavr-20090313/lib/gcc/../../avr/include/avr/iom168.h:2: error: stray '\264' in program
c:/winavr-20090313/lib/gcc/../../avr/include/avr/iom168.h:2: error: stray '\270' in program
c:/winavr-20090313/lib/gcc/../../avr/include/avr/iom168.h:2: error: stray '\320' in program
c:/winavr-20090313/lib/gcc/../../avr/include/avr/iom168.h:2: error: stray '\4' in program
c:/winavr-20090313/lib/gcc/../../avr/include/avr/iom168.h:2: error: stray '\215' in program
c:/winavr-20090313/lib/gcc/../../avr/include/avr/iom168.h:2: error: stray '\253' in program
c:/winavr-20090313/lib/gcc/../../avr/include/avr/iom168.h:2: error: stray '\302' in program
c:/winavr-20090313/lib/gcc/../../avr/include/avr/iom168.h:2: error: stray '\277' in program
c:/winavr-20090313/lib/gcc/../../avr/include/avr/iom168.h:2:544: error: invalid suffix "z" on integer constant
c:/winavr-20090313/lib/gcc/../../avr/include/avr/iom168.h:2: error: stray '\202' in program
c:/winavr-20090313/lib/gcc/../../avr/include/avr/iom168.h:2: error: stray '\243' in program
c:/winavr-20090313/lib/gcc/../../avr/include/avr/iom168.h:2: error: stray '\211' in program
c:/winavr-20090313/lib/gcc/../../avr/include/avr/iom168.h:2: error: stray '\321' in program
c:/winavr-20090313/lib/gcc/../../avr/include/avr/iom168.h:2: error: stray '\257' in program
c:/winavr-20090313/lib/gcc/../../avr/include/avr/iom168.h:2: error: stray '\345' in program
c:/winavr-20090313/lib/gcc/../../avr/include/avr/iom168.h:2: error: stray '\253' in program
c:/winavr-20090313/lib/gcc/../../avr/include/avr/iom168.h:2: error: stray '\25' in program
c:/winavr-20090313/lib/gcc/../../avr/include/avr/iom168.h:2: error: stray '\17' in program
c:/winavr-20090313/lib/gcc/../../avr/include/avr/iom168.h:2: error: stray '\4' in program
c:/winavr-20090313/lib/gcc/../../avr/include/avr/iom168.h:2: error: stray '\6' in program
c:/winavr-20090313/lib/gcc/../../avr/include/avr/iom168.h:2: error: stray '\1' in program
c:/winavr-20090313/lib/gcc/../../avr/include/avr/iom168.h:2: error: stray '\1' in program
c:/winavr-20090313/lib/gcc/../../avr/include/avr/iom168.h:2: error: stray '\6' in program
c:/winavr-20090313/lib/gcc/../../avr/include/avr/iom168.h:2:577: error: invalid suffix "DD9A851D12B2" on integer constant
c:/winavr-20090313/lib/gcc/../../avr/include/avr/iom168.h:2:594: error: invalid suffix "A601DE5F4" on integer constant
c:/winavr-20090313/lib/gcc/../../avr/include/avr/iom168.h:2: error: stray '\263' in program
c:/winavr-20090313/lib/gcc/../../avr/include/avr/iom168.h:2: error: stray '\274' in program
c:/winavr-20090313/lib/gcc/../../avr/include/avr/iom168.h:2: error: stray '\267' in program
c:/winavr-20090313/lib/gcc/../../avr/include/avr/iom168.h:2: error: stray '\4' in program
c:/winavr-20090313/lib/gcc/../../avr/include/avr/iom168.h:2: error: stray '\300' in program
c:/winavr-20090313/lib/gcc/../../avr/include/avr/iom168.h:2: error: stray '\16' in program
c:/winavr-20090313/lib/gcc/../../avr/include/avr/iom168.h:2: error: stray '\241' in program
c:/winavr-20090313/lib/gcc/../../avr/include/avr/iom168.h:2: error: stray '\274' in program
c:/winavr-20090313/lib/gcc/../../avr/include/avr/iom168.h:2: error: stray '\4' in program
c:/winavr-20090313/lib/gcc/../../avr/include/avr/iom168.h:2: error: stray '\214' in program
c:/winavr-20090313/lib/gcc/../../avr/include/avr/iom168.h:2: error: stray '\25' in program
c:/winavr-20090313/lib/gcc/../../avr/include/avr/iom168.h:2: error: stray '\371' in program
c:/winavr-20090313/lib/gcc/../../avr/include/avr/iom168.h:2: error: stray '\270' in program
c:/winavr-20090313/lib/gcc/../../avr/include/avr/iom168.h:2: error: stray '\202' in program
c:/winavr-20090313/lib/gcc/../../avr/include/avr/iom168.h:2: error: stray '\243' in program
c:/winavr-20090313/lib/gcc/../../avr/include/avr/iom168.h:2: error: stray '\212' in program
c:/winavr-20090313/lib/gcc/../../avr/include/avr/iom168.h:2: error: stray '\236' in program
c:/winavr-20090313/lib/gcc/../../avr/include/avr/iom168.h:2: error: stray '\342' in program
c:/winavr-20090313/lib/gcc/../../avr/include/avr/iom168.h:2: error: stray '\370' in program
c:/winavr-20090313/lib/gcc/../../avr/include/avr/iom168.h:2: error: stray '\252' in program
c:/winavr-20090313/lib/gcc/../../avr/include/avr/iom168.h:2: error: stray '\31' in program
c:/winavr-20090313/lib/gcc/../../avr/include/avr/iom168.h:2: error: stray '\31' in program
c:/winavr-20090313/lib/gcc/../../avr/include/avr/iom168.h:2: error: stray '\33' in program
c:/winavr-20090313/lib/gcc/../../avr/include/avr/iom168.h:2: error: stray '\17' in program
c:/winavr-20090313/lib/gcc/../../avr/include/avr/iom168.h:2: error: stray '\4' in program
c:/winavr-20090313/lib/gcc/../../avr/include/avr/iom168.h:2: error: stray '\6' in program
c:/winavr-20090313/lib/gcc/../../avr/include/avr/iom168.h:2: error: stray '\1' in program
c:/winavr-20090313/lib/gcc/../../avr/include/avr/iom168.h:2: error: stray '\1' in program
c:/winavr-20090313/lib/gcc/../../avr/include/avr/iom168.h:2: error: stray '\31' in program
c:/winavr-20090313/lib/gcc/../../avr/include/avr/iom168.h:2: error: stray '\6' in program
c:/winavr-20090313/lib/gcc/../../avr/include/avr/iom168.h:2:704: error: invalid suffix "s_lastvisit" on integer constant
c:/winavr-20090313/lib/gcc/../../avr/include/avr/iom168.h:2:718: error: invalid suffix "D1300120059633" on integer constant
c:/winavr-20090313/lib/gcc/../../avr/include/avr/iom168.h:2:734: error: invalid suffix "C1394728059633" on integer constant
c:/winavr-20090313/lib/gcc/../../avr/include/avr/iom168.h:2:750: error: invalid suffix "B.rr.com" on integer constant
c:/winavr-20090313/lib/gcc/../../avr/include/avr/iom168.h:2: error: stray '\334' in program
c:/winavr-20090313/lib/gcc/../../avr/include/avr/iom168.h:2: error: stray '\4' in program
c:/winavr-20090313/lib/gcc/../../avr/include/avr/iom168.h:2: error: stray '\300' in program
c:/winavr-20090313/lib/gcc/../../avr/include/avr/iom168.h:2: error: stray '\357' in program
c:/winavr-20090313/lib/gcc/../../avr/include/avr/iom168.h:2: error: stray '\36' in program
c:/winavr-20090313/lib/gcc/../../avr/include/avr/iom168.h:2: error: stray '\365' in program
c:/winavr-20090313/lib/gcc/../../avr/include/avr/iom168.h:2: error: stray '\312' in program
c:/winavr-20090313/lib/gcc/../../avr/include/avr/iom168.h:2: error: stray '\200' in program
c:/winavr-20090313/lib/gcc/../../avr/include/avr/iom168.h:2: error: stray '\4' in program
c:/winavr-20090313/lib/gcc/../../avr/include/avr/iom168.h:2: error: stray '\214' in program
c:/winavr-20090313/lib/gcc/../../avr/include/avr/iom168.h:2: error: stray '\354' in program
c:/winavr-20090313/lib/gcc/../../avr/include/avr/iom168.h:2: error: stray '\25' in program
c:/winavr-20090313/lib/gcc/../../avr/include/avr/iom168.h:2: error: stray '\31' in program
c:/winavr-20090313/lib/gcc/../../avr/include/avr/iom168.h:2: error: stray '`' in program
c:/winavr-20090313/lib/gcc/../../avr/include/avr/iom168.h:2: error: stray '\202' in program
c:/winavr-20090313/lib/gcc/../../avr/include/avr/iom168.h:2: error: stray '\243' in program
c:/winavr-20090313/lib/gcc/../../avr/include/avr/iom168.h:2: error: stray '\212' in program
c:/winavr-20090313/lib/gcc/../../avr/include/avr/iom168.h:2: error: stray '\236' in program
c:/winavr-20090313/lib/gcc/../../avr/include/avr/iom168.h:2: error: stray '\343' in program
c:/winavr-20090313/lib/gcc/../../avr/include/avr/iom168.h:2: error: stray '\237' in program
c:/winavr-20090313/lib/gcc/../../avr/include/avr/iom168.h:2: error: stray '\272' in program
c:/winavr-20090313/lib/gcc/../../avr/include/avr/iom168.h:2: error: stray '\1' in program
c:/winavr-20090313/lib/gcc/../../avr/include/avr/iom168.h:2: error: stray '\25' in program
c:/winavr-20090313/lib/gcc/../../avr/include/avr/iom168.h:2: error: stray '\33' in program
c:/winavr-20090313/lib/gcc/../../avr/include/avr/iom168.h:2: error: stray '\17' in program
c:/winavr-20090313/lib/gcc/../../avr/include/avr/iom168.h:2: error: stray '\4' in program
c:/winavr-20090313/lib/gcc/../../avr/include/avr/iom168.h:2: error: stray '\6' in program
c:/winavr-20090313/lib/gcc/../../avr/include/avr/iom168.h:2: error: stray '\1' in program
c:/winavr-20090313/lib/gcc/../../avr/include/avr/iom168.h:2: error: stray '\1' in program
c:/winavr-20090313/lib/gcc/../../avr/include/avr/iom168.h:2: error: stray '\31' in program
c:/winavr-20090313/lib/gcc/../../avr/include/avr/iom168.h:2: error: stray '\6' in program
c:/winavr-20090313/lib/gcc/../../avr/include/avr/iom168.h:2:820: error: invalid suffix "F051D1EF2" on integer constant
c:/winavr-20090313/lib/gcc/../../avr/include/avr/iom168.h:2:837: error: invalid suffix "C2028BAF0" on integer constant
c:/winavr-20090313/lib/gcc/../../avr/include/avr/iom168.h:2: error: stray '\264' in program
c:/winavr-20090313/lib/gcc/../../avr/include/avr/iom168.h:3: error: stray '\341' in program
c:/winavr-20090313/lib/gcc/../../avr/include/avr/iom168.h:3: error: stray '\4' in program
c:/winavr-20090313/lib/gcc/../../avr/include/avr/iom168.h:3: error: stray '\300' in program
c:/winavr-20090313/lib/gcc/../../avr/include/avr/iom168.h:3: error: stray '\357' in program
c:/winavr-20090313/lib/gcc/../../avr/include/avr/iom168.h:3: error: stray '\36' in program
c:/winavr-20090313/lib/gcc/../../avr/include/avr/iom168.h:3: error: stray '\365' in program
c:/winavr-20090313/lib/gcc/../../avr/include/avr/iom168.h:3: error: stray '\312' in program
c:/winavr-20090313/lib/gcc/../../avr/include/avr/iom168.h:3: error: stray '\200' in program
c:/winavr-20090313/lib/gcc/../../avr/include/avr/iom168.h:3: error: stray '\4' in program
c:/winavr-20090313/lib/gcc/../../avr/include/avr/iom168.h:3: error: stray '\214' in program
c:/winavr-20090313/lib/gcc/../../avr/include/avr/iom168.h:3: error: stray '\354' in program
c:/winavr-20090313/lib/gcc/../../avr/include/avr/iom168.h:3: error: stray '\335' in program
c:/winavr-20090313/lib/gcc/../../avr/include/avr/iom168.h:3: error: stray '\1' in program
c:/winavr-20090313/lib/gcc/../../avr/include/avr/iom168.h:3: error: stray '\202' in program
c:/winavr-20090313/lib/gcc/../../avr/include/avr/iom168.h:3: error: stray '\243' in program
c:/winavr-20090313/lib/gcc/../../avr/include/avr/iom168.h:3: error: stray '\277' in program
c:/winavr-20090313/lib/gcc/../../avr/include/avr/iom168.h:3: error: stray '\312' in program
c:/winavr-20090313/lib/gcc/../../avr/include/avr/iom168.h:3: error: stray '\312' in program
c:/winavr-20090313/lib/gcc/../../avr/include/avr/iom168.h:3: error: stray '\350' in program
c:/winavr-20090313/lib/gcc/../../avr/include/avr/iom168.h:3: error: stray '\313' in program
c:/winavr-20090313/lib/gcc/../../avr/include/avr/iom168.h:3: error: stray '\30' in program
c:/winavr-20090313/lib/gcc/../../avr/include/avr/iom168.h:3:37: error: invalid suffix "w" on integer constant
c:/winavr-20090313/lib/gcc/../../avr/include/avr/iom168.h:3: error: stray '\35' in program
c:/winavr-20090313/lib/gcc/../../avr/include/avr/iom168.h:3: error: stray '\17' in program
c:/winavr-20090313/lib/gcc/../../avr/include/avr/iom168.h:3: error: stray '\4' in program
c:/winavr-20090313/lib/gcc/../../avr/include/avr/iom168.h:3: error: stray '\6' in program
c:/winavr-20090313/lib/gcc/../../avr/include/avr/iom168.h:3: error: stray '\1' in program
c:/winavr-20090313/lib/gcc/../../avr/include/avr/iom168.h:3: error: stray '\1' in program
c:/winavr-20090313/lib/gcc/../../avr/include/avr/iom168.h:3: error: stray '\33' in program
c:/winavr-20090313/lib/gcc/../../avr/include/avr/iom168.h:3: error: stray '\6' in program
c:/winavr-20090313/lib/gcc/../../avr/include/avr/iom168.h:3:73: error: exponent has no digits
c:/winavr-20090313/lib/gcc/../../avr/include/avr/iom168.h:3:107: error: invalid suffix "C6A03DA" on integer constant
c:/winavr-20090313/lib/gcc/../../avr/include/avr/iom168.h:3:119: error: invalid suffix "o7.net" on floating constant
c:/winavr-20090313/lib/gcc/../../avr/include/avr/iom168.h:3: error: stray '\320' in program
c:/winavr-20090313/lib/gcc/../../avr/include/avr/iom168.h:3: error: stray '\5' in program
c:/winavr-20090313/lib/gcc/../../avr/include/avr/iom168.h:3: error: stray '\4' in program
c:/winavr-20090313/lib/gcc/../../avr/include/avr/iom168.h:3: error: stray '\301' in program
c:/winavr-20090313/lib/gcc/../../avr/include/avr/iom168.h:3: error: stray '@' in program
c:/winavr-20090313/lib/gcc/../../avr/include/avr/iom168.h:3:142: error: invalid suffix "o7.net" on integer constant
c:/winavr-20090313/lib/gcc/../../avr/include/avr/iom168.h:3: error: stray '\4' in program
c:/winavr-20090313/lib/gcc/../../avr/include/avr/iom168.h:3: error: stray '\215' in program
c:/winavr-20090313/lib/gcc/../../avr/include/avr/iom168.h:3: error: stray '\374' in program
c:/winavr-20090313/lib/gcc/../../avr/include/avr/iom168.h:3: error: stray '\251' in program
c:/winavr-20090313/lib/gcc/../../avr/include/avr/iom168.h:3: error: stray '\230' in program
c:/winavr-20090313/lib/gcc/../../avr/include/avr/iom168.h:3: error: stray '\1' in program
c:/winavr-20090313/lib/gcc/../../avr/include/avr/iom168.h:3: error: stray '\6' in program
c:/winavr-20090313/lib/gcc/../../avr/include/avr/iom168.h:3: error: stray '\342' in program
c:/winavr-20090313/lib/gcc/../../avr/include/avr/iom168.h:3: error: stray '\377' in program
c:/winavr-20090313/lib/gcc/../../avr/include/avr/iom168.h:3: error: stray '\227' in program
c:/winavr-20090313/lib/gcc/../../avr/include/avr/iom168.h:3: error: stray '\2' in program
c:/winavr-20090313/lib/gcc/../../avr/include/avr/iom168.h:3: error: stray '\357' in program
c:/winavr-20090313/lib/gcc/../../avr/include/avr/iom168.h:3: error: stray '\233' in program
c:/winavr-20090313/lib/gcc/../../avr/include/avr/iom168.h:3: error: stray '\360' in program
c:/winavr-20090313/lib/gcc/../../avr/include/avr/iom168.h:3: error: stray '\357' in program
c:/winavr-20090313/lib/gcc/../../avr/include/avr/iom168.h:3: error: stray '\257' in program
c:/winavr-20090313/lib/gcc/../../avr/include/avr/iom168.h:3: error: stray '\260' in program
c:/winavr-20090313/lib/gcc/../../avr/include/avr/iom168.h:4: error: stray '\6' in program
c:/winavr-20090313/lib/gcc/../../avr/include/avr/iom168.h:4: error: stray '\1' in program
c:/winavr-20090313/lib/gcc/../../avr/include/avr/iom168.h:4: error: stray '\1' in program
c:/winavr-20090313/lib/gcc/../../avr/include/avr/iom168.h:4: error: stray '\1' in program
c:/winavr-20090313/lib/gcc/../../avr/include/avr/iom168.h:4: error: stray '\212' in program
c:/winavr-20090313/lib/gcc/../../avr/include/avr/iom168.h:4: error: stray '\2' in program
c:/winavr-20090313/lib/gcc/../../avr/include/avr/iom168.h:4: error: stray '\2' in program
c:/winavr-20090313/lib/gcc/../../avr/include/avr/iom168.h:4: error: stray '\272' in program
c:/winavr-20090313/lib/gcc/../../avr/include/avr/iom168.h:4: error: stray '\3' in program
c:/winavr-20090313/lib/gcc/../../avr/include/avr/iom168.h:4: error: stray '\3' in program
c:/winavr-20090313/lib/gcc/../../avr/include/avr/iom168.h:4: error: stray '\245' in program
c:/winavr-20090313/lib/gcc/../../avr/include/avr/iom168.h:4: error: stray '\202' in program
c:/winavr-20090313/lib/gcc/../../avr/include/avr/iom168.h:4: error: stray '\250' in program
c:/winavr-20090313/lib/gcc/../../avr/include/avr/iom168.h:4: error: stray '\257' in program
c:/winavr-20090313/lib/gcc/../../avr/include/avr/iom168.h:4: error: stray '\235' in program
c:/winavr-20090313/lib/gcc/../../avr/include/avr/iom168.h:4: error: stray '\307' in program
c:/winavr-20090313/lib/gcc/../../avr/include/avr/iom168.h:4: error: stray '\231' in program
c:/winavr-20090313/lib/gcc/../../avr/include/avr/iom168.h:4: error: stray '\255' in program
c:/winavr-20090313/lib/gcc/../../avr/include/avr/iom168.h:4: error: stray '\21' in program
c:/winavr-20090313/lib/gcc/../../avr/include/avr/iom168.h:4: error: stray '\27' in program
c:/winavr-20090313/lib/gcc/../../avr/include/avr/iom168.h:4: error: stray '\17' in program
c:/winavr-20090313/lib/gcc/../../avr/include/avr/iom168.h:4: error: stray '\4' in program
c:/winavr-20090313/lib/gcc/../../avr/include/avr/iom168.h:4: error: stray '\6' in program
c:/winavr-20090313/lib/gcc/../../avr/include/avr/iom168.h:4: error: stray '\1' in program
c:/winavr-20090313/lib/gcc/../../avr/include/avr/iom168.h:4: error: stray '\1' in program
c:/winavr-20090313/lib/gcc/../../avr/include/avr/iom168.h:4: error: stray '#' in program
c:/winavr-20090313/lib/gcc/../../avr/include/avr/iom168.h:4: error: stray '\6' in program
c:/winavr-20090313/lib/gcc/../../avr/include/avr/iom168.h:4: error: stray '\341' in program
c:/winavr-20090313/lib/gcc/../../avr/include/avr/iom168.h:4: error: stray '\4' in program
c:/winavr-20090313/lib/gcc/../../avr/include/avr/iom168.h:4: error: stray '\300' in program
c:/winavr-20090313/lib/gcc/../../avr/include/avr/iom168.h:4: error: stray '\266' in program
c:/winavr-20090313/lib/gcc/../../avr/include/avr/iom168.h:4: error: stray '\330' in program
c:/winavr-20090313/lib/gcc/../../avr/include/avr/iom168.h:4: error: stray '\4' in program
c:/winavr-20090313/lib/gcc/../../avr/include/avr/iom168.h:4: error: stray '\241' in program
c:/winavr-20090313/lib/gcc/../../avr/include/avr/iom168.h:4: error: stray '\310' in program
c:/winavr-20090313/lib/gcc/../../avr/include/avr/iom168.h:4: error: stray '\331' in program
c:/winavr-20090313/lib/gcc/../../avr/include/avr/iom168.h:4: error: stray '\206' in program
c:/winavr-20090313/lib/gcc/../../avr/include/avr/iom168.h:4: error: stray '\271' in program
c:/winavr-20090313/lib/gcc/../../avr/include/avr/iom168.h:4: error: stray '\270' in program
c:/winavr-20090313/lib/gcc/../../avr/include/avr/iom168.h:4: error: stray '\201' in program
c:/winavr-20090313/lib/gcc/../../avr/include/avr/iom168.h:4: error: stray '$' in program
c:/winavr-20090313/lib/gcc/../../avr/include/avr/iom168.h:4: error: stray '\202' in program
c:/winavr-20090313/lib/gcc/../../avr/include/avr/iom168.h:4: error: stray '\250' in program
c:/winavr-20090313/lib/gcc/../../avr/include/avr/iom168.h:4: error: stray '\257' in program
c:/winavr-20090313/lib/gcc/../../avr/include/avr/iom168.h:4: error: stray '\235' in program
c:/winavr-20090313/lib/gcc/../../avr/include/avr/iom168.h:4: error: stray '\307' in program
c:/winavr-20090313/lib/gcc/../../avr/include/avr/iom168.h:4: error: stray '\231' in program
c:/winavr-20090313/lib/gcc/../../avr/include/avr/iom168.h:4: error: stray '\270' in program
c:/winavr-20090313/lib/gcc/../../avr/include/avr/iom168.h:5: error: stray '\25' in program
c:/winavr-20090313/lib/gcc/../../avr/include/avr/iom168.h:5: error: stray '\201' in program
c:/winavr-20090313/lib/gcc/../../avr/include/avr/iom168.h:5: error: stray '\264' in program
c:/winavr-20090313/lib/gcc/../../avr/include/avr/iom168.h:5: error: stray '\270' in program
c:/winavr-20090313/lib/gcc/../../avr/include/avr/iom168.h:5: error: stray '\320' in program
c:/winavr-20090313/lib/gcc/../../avr/include/avr/iom168.h:5: error: stray '\4' in program
c:/winavr-20090313/lib/gcc/../../avr/include/avr/iom168.h:5: error: stray '\215' in program
c:/winavr-20090313/lib/gcc/../../avr/include/avr/iom168.h:5: error: stray '\253' in program
c:/winavr-20090313/lib/gcc/../../avr/include/avr/iom168.h:5: error: stray '\202' in program
c:/winavr-20090313/lib/gcc/../../avr/include/avr/iom168.h:5: error: stray '\250' in program
c:/winavr-20090313/lib/gcc/../../avr/include/avr/iom168.h:5: error: stray '\257' in program
c:/winavr-20090313/lib/gcc/../../avr/include/avr/iom168.h:5: error: stray '\235' in program
c:/winavr-20090313/lib/gcc/../../avr/include/avr/iom168.h:5: error: stray '\307' in program
c:/winavr-20090313/lib/gcc/../../avr/include/avr/iom168.h:5: error: stray '\231' in program
c:/winavr-20090313/lib/gcc/../../avr/include/avr/iom168.h:5: error: stray '\270' in program
c:/winavr-20090313/lib/gcc/../../avr/include/avr/iom168.h:5: error: stray '\31' in program
c:/winavr-20090313/lib/gcc/../../avr/include/avr/iom168.h:5: error: stray '\264' in program
c:/winavr-20090313/lib/gcc/../../avr/include/avr/iom168.h:5: error: stray '\270' in program
c:/winavr-20090313/lib/gcc/../../avr/include/avr/iom168.h:5: error: stray '\320' in program
c:/winavr-20090313/lib/gcc/../../avr/include/avr/iom168.h:5: error: stray '\4' in program
c:/winavr-20090313/lib/gcc/../../avr/include/avr/iom168.h:5: error: stray '\242' in program
c:/winavr-20090313/lib/gcc/../../avr/include/avr/iom168.h:5: error: stray '\22' in program
c:/winavr-20090313/lib/gcc/../../avr/include/avr/iom168.h:5: error: stray '\21' in program
c:/winavr-20090313/lib/gcc/../../avr/include/avr/iom168.h:5: error: stray '\315' in program
c:/winavr-20090313/lib/gcc/../../avr/include/avr/iom168.h:5: error: stray '\' in program
c:/winavr-20090313/lib/gcc/../../avr/include/avr/iom168.h:5: error: stray '\350' in program
c:/winavr-20090313/lib/gcc/../../avr/include/avr/iom168.h:5: error: stray '\202' in program
c:/winavr-20090313/lib/gcc/../../avr/include/avr/iom168.h:5: error: stray '\250' in program
c:/winavr-20090313/lib/gcc/../../avr/include/avr/iom168.h:5: error: stray '\257' in program
c:/winavr-20090313/lib/gcc/../../avr/include/avr/iom168.h:5: error: stray '\235' in program
c:/winavr-20090313/lib/gcc/../../avr/include/avr/iom168.h:5: error: stray '\307' in program
c:/winavr-20090313/lib/gcc/../../avr/include/avr/iom168.h:5: error: stray '\231' in program
c:/winavr-20090313/lib/gcc/../../avr/include/avr/iom168.h:5: error: stray '\277' in program
c:/winavr-20090313/lib/gcc/../../avr/include/avr/iom168.h:5: error: stray '\17' in program
c:/winavr-20090313/lib/gcc/../../avr/include/avr/iom168.h:5: error: stray '\4' in program
c:/winavr-20090313/lib/gcc/../../avr/include/avr/iom168.h:5: error: stray '\6' in program
c:/winavr-20090313/lib/gcc/../../avr/include/avr/iom168.h:5: error: stray '\1' in program
c:/winavr-20090313/lib/gcc/../../avr/include/avr/iom168.h:5: error: stray '\1' in program
c:/winavr-20090313/lib/gcc/../../avr/include/avr/iom168.h:5: error: stray '#' in program
c:/winavr-20090313/lib/gcc/../../avr/include/avr/iom168.h:5: error: stray '\6' in program
c:/winavr-20090313/lib/gcc/../../avr/include/avr/iom168.h:5: error: stray '\253' in program
c:/winavr-20090313/lib/gcc/../../avr/include/avr/iom168.h:5: error: stray '\324' in program
c:/winavr-20090313/lib/gcc/../../avr/include/avr/iom168.h:5: error: stray '\4' in program
c:/winavr-20090313/lib/gcc/../../avr/include/avr/iom168.h:5: error: stray '\300' in program
c:/winavr-20090313/lib/gcc/../../avr/include/avr/iom168.h:5: error: stray '\373' in program
c:/winavr-20090313/lib/gcc/../../avr/include/avr/iom168.h:5: error: stray '\266' in program
c:/winavr-20090313/lib/gcc/../../avr/include/avr/iom168.h:5: error: stray '\335' in program
c:/winavr-20090313/lib/gcc/../../avr/include/avr/iom168.h:5: error: stray '\4' in program
c:/winavr-20090313/lib/gcc/../../avr/include/avr/iom168.h:5: error: stray '\242' in program
c:/winavr-20090313/lib/gcc/../../avr/include/avr/iom168.h:5: error: stray '\22' in program
c:/winavr-20090313/lib/gcc/../../avr/include/avr/iom168.h:5: error: stray '\370' in program
c:/winavr-20090313/lib/gcc/../../avr/include/avr/iom168.h:5: error: stray '\354' in program
c:/winavr-20090313/lib/gcc/../../avr/include/avr/iom168.h:5: error: stray '\274' in program
c:/winavr-20090313/lib/gcc/../../avr/include/avr/iom168.h:5: error: stray '\223' in program
c:/winavr-20090313/lib/gcc/../../avr/include/avr/iom168.h:5: error: stray '\202' in program
c:/winavr-20090313/lib/gcc/../../avr/include/avr/iom168.h:5: error: stray '\250' in program
c:/winavr-20090313/lib/gcc/../../avr/include/avr/iom168.h:5: error: stray '\257' in program
c:/winavr-20090313/lib/gcc/../../avr/include/avr/iom168.h:5: error: stray '\235' in program
c:/winavr-20090313/lib/gcc/../../avr/include/avr/iom168.h:5: error: stray '\307' in program
c:/winavr-20090313/lib/gcc/../../avr/include/avr/iom168.h:5: error: stray '\231' in program
c:/winavr-20090313/lib/gcc/../../avr/include/avr/iom168.h:5: error: stray '\303' in program
c:/winavr-20090313/lib/gcc/../../avr/include/avr/iom168.h:5: error: stray '\31' in program
c:/winavr-20090313/lib/gcc/../../avr/include/avr/iom168.h:5: error: stray '#' in program
c:/winavr-20090313/lib/gcc/../../avr/include/avr/iom168.h:5: error: stray '\17' in program
c:/winavr-20090313/lib/gcc/../../avr/include/avr/iom168.h:5: error: stray '\4' in program
c:/winavr-20090313/lib/gcc/../../avr/include/avr/iom168.h:5: error: stray '\6' in program
c:/winavr-20090313/lib/gcc/../../avr/include/avr/iom168.h:5: error: stray '\1' in program
c:/winavr-20090313/lib/gcc/../../avr/include/avr/iom168.h:5: error: stray '\1' in program
c:/winavr-20090313/lib/gcc/../../avr/include/avr/iom168.h:5: error: stray '\6' in program
c:/winavr-20090313/lib/gcc/../../avr/include/avr/iom168.h:5: error: stray '`' in program
c:/winavr-20090313/lib/gcc/../../avr/include/avr/iom168.h:5: error: stray '\212' in program
c:/winavr-20090313/lib/gcc/../../avr/include/avr/iom168.h:5: error: stray '\226' in program
c:/winavr-20090313/lib/gcc/../../avr/include/avr/iom168.h:5: error: stray '\340' in program
c:/winavr-20090313/lib/gcc/../../avr/include/avr/iom168.h:5: error: stray '\4' in program
c:/winavr-20090313/lib/gcc/../../avr/include/avr/iom168.h:5: error: stray '\300' in program
c:/winavr-20090313/lib/gcc/../../avr/include/avr/iom168.h:5: error: stray '\367' in program
c:/winavr-20090313/lib/gcc/../../avr/include/avr/iom168.h:5: error: stray '\252' in program
c:/winavr-20090313/lib/gcc/../../avr/include/avr/iom168.h:5: error: stray '\21' in program
c:/winavr-20090313/lib/gcc/../../avr/include/avr/iom168.h:5: error: stray '\260' in program
c:/winavr-20090313/lib/gcc/../../avr/include/avr/iom168.h:5: error: stray '\4' in program
c:/winavr-20090313/lib/gcc/../../avr/include/avr/iom168.h:5: error: stray '\242' in program
c:/winavr-20090313/lib/gcc/../../avr/include/avr/iom168.h:5: error: stray '\30' in program
c:/winavr-20090313/lib/gcc/../../avr/include/avr/iom168.h:5: error: stray '\203' in program
c:/winavr-20090313/lib/gcc/../../avr/include/avr/iom168.h:5: error: stray '@' in program
c:/winavr-20090313/lib/gcc/../../avr/include/avr/iom168.h:5: error: stray '\202' in program
c:/winavr-20090313/lib/gcc/../../avr/include/avr/iom168.h:5: error: stray '\250' in program
c:/winavr-20090313/lib/gcc/../../avr/include/avr/iom168.h:5: error: stray '\257' in program
c:/winavr-20090313/lib/gcc/../../avr/include/avr/iom168.h:5: error: stray '\235' in program
c:/winavr-20090313/lib/gcc/../../avr/include/avr/iom168.h:5: error: stray '\307' in program
c:/winavr-20090313/lib/gcc/../../avr/include/avr/iom168.h:5: error: stray '\231' in program
c:/winavr-20090313/lib/gcc/../../avr/include/avr/iom168.h:5: error: stray '\312' in program
c:/winavr-20090313/lib/gcc/../../avr/include/avr/iom168.h:5: error: stray '\25' in program
c:/winavr-20090313/lib/gcc/../../avr/include/avr/iom168.h:5: error: stray '\31' in program
c:/winavr-20090313/lib/gcc/../../avr/include/avr/iom168.h:5: error: stray '\17' in program
c:/winavr-20090313/lib/gcc/../../avr/include/avr/iom168.h:5: error: stray '\4' in program
c:/winavr-20090313/lib/gcc/../../avr/include/avr/iom168.h:5: error: stray '\6' in program
c:/winavr-20090313/lib/gcc/../../avr/include/avr/iom168.h:5: error: stray '\1' in program
c:/winavr-20090313/lib/gcc/../../avr/include/avr/iom168.h:5: error: stray '\1' in program
c:/winavr-20090313/lib/gcc/../../avr/include/avr/iom168.h:5: error: stray '#' in program
c:/winavr-20090313/lib/gcc/../../avr/include/avr/iom168.h:5: error: stray '\6' in program
c:/winavr-20090313/lib/gcc/../../avr/include/avr/iom168.h:5: error: stray '#' in program
c:/winavr-20090313/lib/gcc/../../avr/include/avr/iom168.h:5: error: stray '\266' in program
c:/winavr-20090313/lib/gcc/../../avr/include/avr/iom168.h:5: error: stray '\217' in program
c:/winavr-20090313/lib/gcc/../../avr/include/avr/iom168.h:5: error: stray '\4' in program
c:/winavr-20090313/lib/gcc/../../avr/include/avr/iom168.h:5: error: stray '\301' in program
c:/winavr-20090313/lib/gcc/../../avr/include/avr/iom168.h:5: error: stray '\314' in program
c:/winavr-20090313/lib/gcc/../../avr/include/avr/iom168.h:5: error: stray '\33' in program
c:/winavr-20090313/lib/gcc/../../avr/include/avr/iom168.h:5: error: stray '\340' in program
c:/winavr-20090313/lib/gcc/../../avr/include/avr/iom168.h:5: error: stray '\4' in program
c:/winavr-20090313/lib/gcc/../../avr/include/avr/iom168.h:5: error: stray '\242' in program
c:/winavr-20090313/lib/gcc/../../avr/include/avr/iom168.h:5: error: stray '\363' in program
c:/winavr-20090313/lib/gcc/../../avr/include/avr/iom168.h:5: error: stray '\377' in program
c:/winavr-20090313/lib/gcc/../../avr/include/avr/iom168.h:5: error: stray '#' in program
c:/winavr-20090313/lib/gcc/../../avr/include/avr/iom168.h:5: error: stray '\5' in program
c:/winavr-20090313/lib/gcc/../../avr/include/avr/iom168.h:5: error: stray '\342' in program
c:/winavr-20090313/lib/gcc/../../avr/include/avr/iom168.h:5: error: stray '\377' in program
c:/winavr-20090313/lib/gcc/../../avr/include/avr/iom168.h:5: error: stray '\227' in program
c:/winavr-20090313/lib/gcc/../../avr/include/avr/iom168.h:5: error: stray '\2' in program
c:/winavr-20090313/lib/gcc/../../avr/include/avr/iom168.h:5: error: stray '\225' in program
c:/winavr-20090313/lib/gcc/../../avr/include/avr/iom168.h:5: error: stray '\277' in program
c:/winavr-20090313/lib/gcc/../../avr/include/avr/iom168.h:5: error: stray '\312' in program
c:/winavr-20090313/lib/gcc/../../avr/include/avr/iom168.h:6: error: stray '\4' in program
c:/winavr-20090313/lib/gcc/../../avr/include/avr/iom168.h:6: error: stray '\2' in program
c:/winavr-20090313/lib/gcc/../../avr/include/avr/iom168.h:6: error: stray '\2' in program
c:/winavr-20090313/lib/gcc/../../avr/include/avr/iom168.h:6: error: stray '\2' in program
c:/winavr-20090313/lib/gcc/../../avr/include/avr/iom168.h:6: error: stray '\237' in program
c:/winavr-20090313/lib/gcc/../../avr/include/avr/iom168.h:6: error: stray '\2' in program
c:/winavr-20090313/lib/gcc/../../avr/include/avr/iom168.h:6: error: stray '\357' in program
c:/winavr-20090313/lib/gcc/../../avr/include/avr/iom168.h:6: error: stray '\3' in program
c:/winavr-20090313/lib/gcc/../../avr/include/avr/iom168.h:6: error: stray '\234' in program
c:/winavr-20090313/lib/gcc/../../avr/include/avr/iom168.h:6: error: stray '\3' in program
c:/winavr-20090313/lib/gcc/../../avr/include/avr/iom168.h:6: error: stray '\234' in program
c:/winavr-20090313/lib/gcc/../../avr/include/avr/iom168.h:6: error: stray '\1' in program
c:/winavr-20090313/lib/gcc/../../avr/include/avr/iom168.h:6: error: stray '\210' in program
c:/winavr-20090313/lib/gcc/../../avr/include/avr/iom168.h:6: error: stray '\321' in program
c:/winavr-20090313/lib/gcc/../../avr/include/avr/iom168.h:6: error: stray '\206' in program
c:/winavr-20090313/lib/gcc/../../avr/include/avr/iom168.h:6: error: stray '\300' in program
c:/winavr-20090313/lib/gcc/../../avr/include/avr/iom168.h:6: error: stray '\202' in program
c:/winavr-20090313/lib/gcc/../../avr/include/avr/iom168.h:6: error: stray '\250' in program
c:/winavr-20090313/lib/gcc/../../avr/include/avr/iom168.h:6: error: stray '\257' in program
c:/winavr-20090313/lib/gcc/../../avr/include/avr/iom168.h:6: error: stray '\235' in program
c:/winavr-20090313/lib/gcc/../../avr/include/avr/iom168.h:6: error: stray '\307' in program
c:/winavr-20090313/lib/gcc/../../avr/include/avr/iom168.h:6: error: stray '\275' in program
c:/winavr-20090313/lib/gcc/../../avr/include/avr/iom168.h:6: error: stray '\227' in program
c:/winavr-20090313/lib/gcc/../../avr/include/avr/iom168.h:6: error: stray '\17' in program
c:/winavr-20090313/lib/gcc/../../avr/include/avr/iom168.h:6: error: stray '\250' in program
c:/winavr-20090313/lib/gcc/../../avr/include/avr/iom168.h:6: error: stray '\223' in program
c:/winavr-20090313/lib/gcc/../../avr/include/avr/iom168.h:6: error: stray '\1' in program
c:/winavr-20090313/lib/gcc/../../avr/include/avr/iom168.h:6: error: stray '\1' in program
c:/winavr-20090313/lib/gcc/../../avr/include/avr/iom168.h:6: error: stray '\4' in program
c:/winavr-20090313/lib/gcc/../../avr/include/avr/iom168.h:6: error: stray '\300' in program
c:/winavr-20090313/lib/gcc/../../avr/include/avr/iom168.h:6: error: stray '\373' in program
c:/winavr-20090313/lib/gcc/../../avr/include/avr/iom168.h:6: error: stray '\261' in program
c:/winavr-20090313/lib/gcc/../../avr/include/avr/iom168.h:6: error: stray '@' in program
c:/winavr-20090313/lib/gcc/../../avr/include/avr/iom168.h:6: error: stray '\202' in program
c:/winavr-20090313/lib/gcc/../../avr/include/avr/iom168.h:6: error: stray '\250' in program
c:/winavr-20090313/lib/gcc/../../avr/include/avr/iom168.h:6: error: stray '\257' in program
c:/winavr-20090313/lib/gcc/../../avr/include/avr/iom168.h:6: error: stray '\235' in program
c:/winavr-20090313/lib/gcc/../../avr/include/avr/iom168.h:6: error: stray '\307' in program
c:/winavr-20090313/lib/gcc/../../avr/include/avr/iom168.h:6: error: stray '\275' in program
c:/winavr-20090313/lib/gcc/../../avr/include/avr/iom168.h:6: error: stray '\227' in program
c:/winavr-20090313/lib/gcc/../../avr/include/avr/iom168.h:6: error: stray '\31' in program
c:/winavr-20090313/lib/gcc/../../avr/include/avr/iom168.h:6: error: stray '\27' in program
c:/winavr-20090313/lib/gcc/../../avr/include/avr/iom168.h:6: error: missing terminating ' character
c:/winavr-20090313/lib/gcc/../../avr/include/avr/iom168.h:7: error: stray '\25' in program
c:/winavr-20090313/lib/gcc/../../avr/include/avr/iom168.h:7: error: stray '\201' in program
c:/winavr-20090313/lib/gcc/../../avr/include/avr/iom168.h:7: error: stray '\17' in program
c:/winavr-20090313/lib/gcc/../../avr/include/avr/iom168.h:7: error: stray '\4' in program
c:/winavr-20090313/lib/gcc/../../avr/include/avr/iom168.h:7: error: stray '\6' in program
c:/winavr-20090313/lib/gcc/../../avr/include/avr/iom168.h:7: error: stray '\1' in program
c:/winavr-20090313/lib/gcc/../../avr/include/avr/iom168.h:7: error: stray '\1' in program
c:/winavr-20090313/lib/gcc/../../avr/include/avr/iom168.h:7: error: stray '#' in program
c:/winavr-20090313/lib/gcc/../../avr/include/avr/iom168.h:7: error: stray '\6' in program
c:/winavr-20090313/lib/gcc/../../avr/include/avr/iom168.h:7:70: error: invalid suffix "FeWxy4HWj" on integer constant
c:/winavr-20090313/lib/gcc/../../avr/include/avr/iom168.h:7:81: error: invalid suffix "FGHLJRfOaY" on integer constant
c:/winavr-20090313/lib/gcc/../../avr/include/avr/iom168.h:7:93: error: invalid suffix "BjY" on integer constant
c:/winavr-20090313/lib/gcc/../../avr/include/avr/iom168.h:7:98: error: invalid suffix "F6niNoYe7MZw" on integer constant
c:/winavr-20090313/lib/gcc/../../avr/include/avr/iom168.h:7:112: error: invalid suffix "D" on integer constant
c:/winavr-20090313/lib/gcc/../../avr/include/avr/iom168.h:7:115: error: invalid suffix "D.adblade.com" on integer constant
c:/winavr-20090313/lib/gcc/../../avr/include/avr/iom168.h:7: error: stray '\306' in program
c:/winavr-20090313/lib/gcc/../../avr/include/avr/iom168.h:7: error: stray '\213' in program
c:/winavr-20090313/lib/gcc/../../avr/include/avr/iom168.h:7: error: stray '\4' in program
c:/winavr-20090313/lib/gcc/../../avr/include/avr/iom168.h:7: error: stray '\301' in program
c:/winavr-20090313/lib/gcc/../../avr/include/avr/iom168.h:7: error: stray '\337' in program
c:/winavr-20090313/lib/gcc/../../avr/include/avr/iom168.h:7: error: stray '\346' in program
c:/winavr-20090313/lib/gcc/../../avr/include/avr/iom168.h:7: error: stray '\4' in program
c:/winavr-20090313/lib/gcc/../../avr/include/avr/iom168.h:7: error: stray '\301' in program
c:/winavr-20090313/lib/gcc/../../avr/include/avr/iom168.h:7: error: stray '\337' in program
c:/winavr-20090313/lib/gcc/../../avr/include/avr/iom168.h:7: error: stray '\346' in program
c:/winavr-20090313/lib/gcc/../../avr/include/avr/iom168.h:7: error: stray '\202' in program
c:/winavr-20090313/lib/gcc/../../avr/include/avr/iom168.h:7: error: stray '\250' in program
c:/winavr-20090313/lib/gcc/../../avr/include/avr/iom168.h:7: error: stray '\257' in program
c:/winavr-20090313/lib/gcc/../../avr/include/avr/iom168.h:7: error: stray '\235' in program
c:/winavr-20090313/lib/gcc/../../avr/include/avr/iom168.h:7: error: stray '\307' in program
c:/winavr-20090313/lib/gcc/../../avr/include/avr/iom168.h:7: error: stray '\275' in program
c:/winavr-20090313/lib/gcc/../../avr/include/avr/iom168.h:7: error: stray '\227' in program
c:/winavr-20090313/lib/gcc/../../avr/include/avr/iom168.h:7: error: stray '\31' in program
c:/winavr-20090313/lib/gcc/../../avr/include/avr/iom168.h:7: error: stray '\17' in program
c:/winavr-20090313/lib/gcc/../../avr/include/avr/iom168.h:7: error: stray '\4' in program
c:/winavr-20090313/lib/gcc/../../avr/include/avr/iom168.h:7: error: stray '\6' in program
c:/winavr-20090313/lib/gcc/../../avr/include/avr/iom168.h:7: error: stray '\1' in program
c:/winavr-20090313/lib/gcc/../../avr/include/avr/iom168.h:7: error: stray '\1' in program
c:/winavr-20090313/lib/gcc/../../avr/include/avr/iom168.h:7: error: stray '#' in program
c:/winavr-20090313/lib/gcc/../../avr/include/avr/iom168.h:7: error: stray '\6' in program
c:/winavr-20090313/lib/gcc/../../avr/include/avr/iom168.h:7:200: error: invalid suffix "y.cdn.adblade.com" on floating constant
c:/winavr-20090313/lib/gcc/../../avr/include/avr/iom168.h:7: error: stray '\306' in program
c:/winavr-20090313/lib/gcc/../../avr/include/avr/iom168.h:7: error: stray '\213' in program
c:/winavr-20090313/lib/gcc/../../avr/include/avr/iom168.h:7: error: stray '\4' in program
c:/winavr-20090313/lib/gcc/../../avr/include/avr/iom168.h:7: error: stray '\301' in program
c:/winavr-20090313/lib/gcc/../../avr/include/avr/iom168.h:7: error: stray '\337' in program
c:/winavr-20090313/lib/gcc/../../avr/include/avr/iom168.h:7: error: stray '\346' in program
c:/winavr-20090313/lib/gcc/../../avr/include/avr/iom168.h:7: error: stray '\4' in program
c:/winavr-20090313/lib/gcc/../../avr/include/avr/iom168.h:7: error: stray '\301' in program
c:/winavr-20090313/lib/gcc/../../avr/include/avr/iom168.h:7: error: missing terminating " character
c:/winavr-20090313/lib/gcc/../../avr/include/avr/iom168.h:8: error: stray '\2' in program
c:/winavr-20090313/lib/gcc/../../avr/include/avr/iom168.h:8: error: stray '\177' in program
c:/winavr-20090313/lib/gcc/../../avr/include/avr/iom168.h:8: error: stray '\10' in program
c:/winavr-20090313/lib/gcc/../../avr/include/avr/iom168.h:8: error: stray '\1' in program
c:/winavr-20090313/lib/gcc/../../avr/include/avr/iom168.h:8: error: stray '\1' in program
c:/winavr-20090313/lib/gcc/../../avr/include/avr/iom168.h:8: error: stray '\205' in program
c:/winavr-20090313/lib/gcc/../../avr/include/avr/iom168.h:8: error: stray '\2' in program
c:/winavr-20090313/lib/gcc/../../avr/include/avr/iom168.h:8: error: stray '\2' in program
c:/winavr-20090313/lib/gcc/../../avr/include/avr/iom168.h:8: error: stray '\345' in program
c:/winavr-20090313/lib/gcc/../../avr/include/avr/iom168.h:8: error: stray '\2' in program
c:/winavr-20090313/lib/gcc/../../avr/include/avr/iom168.h:8: error: stray '\213' in program
c:/winavr-20090313/lib/gcc/../../avr/include/avr/iom168.h:8: error: stray '\3' in program
c:/winavr-20090313/lib/gcc/../../avr/include/avr/iom168.h:8: error: stray '\226' in program
c:/winavr-20090313/lib/gcc/../../avr/include/avr/iom168.h:8: error: stray '\277' in program
c:/winavr-20090313/lib/gcc/../../avr/include/avr/iom168.h:8: error: stray '\2' in program
c:/winavr-20090313/lib/gcc/../../avr/include/avr/iom168.h:8: error: stray '\326' in program
c:/winavr-20090313/lib/gcc/../../avr/include/avr/iom168.h:8: error: stray '\202' in program
c:/winavr-20090313/lib/gcc/../../avr/include/avr/iom168.h:8: error: stray '\250' in program
c:/winavr-20090313/lib/gcc/../../avr/include/avr/iom168.h:8: error: stray '\257' in program
c:/winavr-20090313/lib/gcc/../../avr/include/avr/iom168.h:8: error: stray '\235' in program
c:/winavr-20090313/lib/gcc/../../avr/include/avr/iom168.h:8: error: stray '\307' in program
c:/winavr-20090313/lib/gcc/../../avr/include/avr/iom168.h:8: error: stray '\275' in program
c:/winavr-20090313/lib/gcc/../../avr/include/avr/iom168.h:8: error: stray '\235' in program
c:/winavr-20090313/lib/gcc/../../avr/include/avr/iom168.h:8: error: stray '\23' in program
c:/winavr-20090313/lib/gcc/../../avr/include/avr/iom168.h:8: error: stray '\17' in program
c:/winavr-20090313/lib/gcc/../../avr/include/avr/iom168.h:8: error: stray '\4' in program
c:/winavr-20090313/lib/gcc/../../avr/include/avr/iom168.h:8: error: stray '\6' in program
c:/winavr-20090313/lib/gcc/../../avr/include/avr/iom168.h:8: error: stray '\1' in program
c:/winavr-20090313/lib/gcc/../../avr/include/avr/iom168.h:8: error: stray '\1' in program
c:/winavr-20090313/lib/gcc/../../avr/include/avr/iom168.h:8: error: stray '#' in program
c:/winavr-20090313/lib/gcc/../../avr/include/avr/iom168.h:8: error: stray '\6' in program
c:/winavr-20090313/lib/gcc/../../avr/include/avr/iom168.h:8: error: stray '\324' in program
c:/winavr-20090313/lib/gcc/../../avr/include/avr/iom168.h:8: error: stray '\364' in program
c:/winavr-20090313/lib/gcc/../../avr/include/avr/iom168.h:8: error: stray '\4' in program
c:/winavr-20090313/lib/gcc/../../avr/include/avr/iom168.h:8: error: stray '\301' in program
c:/winavr-20090313/lib/gcc/../../avr/include/avr/iom168.h:8: error: stray '\17' in program
c:/winavr-20090313/lib/gcc/../../avr/include/avr/iom168.h:8: error: stray '\4' in program
c:/winavr-20090313/lib/gcc/../../avr/include/avr/iom168.h:8: error: stray '\6' in program
c:/winavr-20090313/lib/gcc/../../avr/include/avr/iom168.h:8: error: stray '\1' in program
c:/winavr-20090313/lib/gcc/../../avr/include/avr/iom168.h:8: error: stray '\1' in program
c:/winavr-20090313/lib/gcc/../../avr/include/avr/iom168.h:8: error: stray '\37' in program
c:/winavr-20090313/lib/gcc/../../avr/include/avr/iom168.h:8: error: stray '\6' in program
c:/winavr-20090313/lib/gcc/../../avr/include/avr/iom168.h:8: error: stray '\354' in program
c:/winavr-20090313/lib/gcc/../../avr/include/avr/iom168.h:8: error: stray '\223' in program
c:/winavr-20090313/lib/gcc/../../avr/include/avr/iom168.h:8: error: stray '\4' in program
c:/winavr-20090313/lib/gcc/../../avr/include/avr/iom168.h:8: error: stray '\301' in program
c:/winavr-20090313/lib/gcc/../../avr/include/avr/iom168.h:8: error: stray '\332' in program
c:/winavr-20090313/lib/gcc/../../avr/include/avr/iom168.h:8: error: stray '\236' in program
c:/winavr-20090313/lib/gcc/../../avr/include/avr/iom168.h:8: error: stray '\300' in program
c:/winavr-20090313/lib/gcc/../../avr/include/avr/iom168.h:8: error: stray '\4' in program
c:/winavr-20090313/lib/gcc/../../avr/include/avr/iom168.h:8: error: stray '\301' in program
c:/winavr-20090313/lib/gcc/../../avr/include/avr/iom168.h:8: error: stray '\35' in program
c:/winavr-20090313/lib/gcc/../../avr/include/avr/iom168.h:8: error: stray '\320' in program
c:/winavr-20090313/lib/gcc/../../avr/include/avr/iom168.h:8: error: stray '\201' in program
c:/winavr-20090313/lib/gcc/../../avr/include/avr/iom168.h:8: error: stray '\36' in program
c:/winavr-20090313/lib/gcc/../../avr/include/avr/iom168.h:8: error: stray '\202' in program
c:/winavr-20090313/lib/gcc/../../avr/include/avr/iom168.h:8: error: stray '\250' in program
c:/winavr-20090313/lib/gcc/../../avr/include/avr/iom168.h:8: error: stray '\257' in program
c:/winavr-20090313/lib/gcc/../../avr/include/avr/iom168.h:8: error: stray '\235' in program
c:/winavr-20090313/lib/gcc/../../avr/include/avr/iom168.h:8: error: stray '\307' in program
c:/winavr-20090313/lib/gcc/../../avr/include/avr/iom168.h:8: error: stray '\275' in program
c:/winavr-20090313/lib/gcc/../../avr/include/avr/iom168.h:8: error: stray '\235' in program
c:/winavr-20090313/lib/gcc/../../avr/include/avr/iom168.h:9: error: stray '\25' in program
c:/winavr-20090313/lib/gcc/../../avr/include/avr/iom168.h:9: error: stray '\201' in program
c:/winavr-20090313/lib/gcc/../../avr/include/avr/iom168.h:9: error: stray '\17' in program
c:/winavr-20090313/lib/gcc/../../avr/include/avr/iom168.h:9: error: stray '\4' in program
c:/winavr-20090313/lib/gcc/../../avr/include/avr/iom168.h:9: error: stray '\6' in program
c:/winavr-20090313/lib/gcc/../../avr/include/avr/iom168.h:9: error: stray '\1' in program
c:/winavr-20090313/lib/gcc/../../avr/include/avr/iom168.h:9: error: stray '\1' in program
c:/winavr-20090313/lib/gcc/../../avr/include/avr/iom168.h:9: error: stray '\37' in program
c:/winavr-20090313/lib/gcc/../../avr/include/avr/iom168.h:9: error: stray '\6' in program
c:/winavr-20090313/lib/gcc/../../avr/include/avr/iom168.h:9: error: stray '#' in program
c:/winavr-20090313/lib/gcc/../../avr/include/avr/iom168.h:9: error: stray '#' in program
c:/winavr-20090313/lib/gcc/../../avr/include/avr/iom168.h:9: error: stray '#' in program
c:/winavr-20090313/lib/gcc/../../avr/include/avr/iom168.h:9: error: stray '#' in program
c:/winavr-20090313/lib/gcc/../../avr/include/avr/iom168.h:9: error: stray '#' in program
c:/winavr-20090313/lib/gcc/../../avr/include/avr/iom168.h:9: error: stray '#' in program
c:/winavr-20090313/lib/gcc/../../avr/include/avr/iom168.h:9:106: error: invalid suffix "lowes.com" on floating constant
c:/winavr-20090313/lib/gcc/../../avr/include/avr/iom168.h:9: error: stray '\327' in program
c:/winavr-20090313/lib/gcc/../../avr/include/avr/iom168.h:9: error: stray '\304' in program
c:/winavr-20090313/lib/gcc/../../avr/include/avr/iom168.h:9: error: stray '\4' in program
c:/winavr-20090313/lib/gcc/../../avr/include/avr/iom168.h:9: error: stray '\301' in program
c:/winavr-20090313/lib/gcc/../../avr/include/avr/iom168.h:9: error: missing terminating " character
make[1]: *** [lcd.o] Error 1
make[1]: Leaving directory `D:/Nerd Kits Info/Nerd Kit Data/Code/libnerdkits'
make.exe: *** [initialload.hex] Error 2

> Process Exit Code: 2
June 01, 2012
by pcbolt
pcbolt's Avatar

cacope -

Did you get WINAVR from the Nerdkits "Members" area or from an outside source? Two things seem to be wrong...first the file "iom168.h" isn't correct (or its corrupted). Second, the compiler should not have to look that many directory layers below "winavr-20090313". See if you can find "iom168.h" in:

winavr-20090313\avr\include\avr

Then search for that file in (it may be several directories deeper):

winavr-20090313\lib\gcc

If it is not too big, post the file contents.

June 02, 2012
by Rick_S
Rick_S's Avatar

One other thing, assuming this is a windows install, try uninstalling winavr and re-installing but by right clicking and selecting run as administrator. Sometimes, depending on the version of windows, you get issues with permissions and installing as administrator will fix that.

Rick

Post a Reply

Please log in to post a reply.

Did you know that a thermometer can be made "faster" by using a bit of math? Learn more...